FABBRICAZIONE DI GIOIELLERIA, BIGIOTTERIA E ARTICOLI CONNESSI; LAVORAZIONE DELLE PIETRE PREZIOSE
type: PrivateOrgActivityType
type: Concept
definition: Questo gruppo include la fabbricazione di gioielleria e articoli di imitazione di gioielleria.
has rank order: 3
in scheme: ateco-2007
notation: 32.1
narrower: https://w3id.org/italia/controlled-vocabulary/classifications-for-organizations/ateco-2007/3213
narrower: https://w3id.org/italia/controlled-vocabulary/classifications-for-organizations/ateco-2007/3211
narrower: https://w3id.org/italia/controlled-vocabulary/classifications-for-organizations/ateco-2007/3212
broader: https://w3id.org/italia/controlled-vocabulary/classifications-for-organizations/ateco-2007/32