ALTRE INDUSTRIE MANIFATTURIERE
type: Concept
type: PrivateOrgActivityType
definition: Questa divisione include la fabbricazione di beni non compresi altrove in questa classificazione. Poichà© si tratta di una divisione residuale, i processi di produzione, le materie prime e l'uso di beni prodotti possono essere molto variabili, di conseguenza non sono stati applicati i normali criteri per raggruppare le classi nelle divisioni.
narrower: https://w3id.org/italia/controlled-vocabulary/classifications-for-organizations/ateco-2007/323
narrower: https://w3id.org/italia/controlled-vocabulary/classifications-for-organizations/ateco-2007/324
narrower: https://w3id.org/italia/controlled-vocabulary/classifications-for-organizations/ateco-2007/325
narrower: https://w3id.org/italia/controlled-vocabulary/classifications-for-organizations/ateco-2007/329
narrower: https://w3id.org/italia/controlled-vocabulary/classifications-for-organizations/ateco-2007/322
narrower: https://w3id.org/italia/controlled-vocabulary/classifications-for-organizations/ateco-2007/321
broader: https://w3id.org/italia/controlled-vocabulary/classifications-for-organizations/ateco-2007/C
in scheme: ateco-2007
has rank order: 2
notation: 32