Riparazione e manutenzione di prodotti in metallo
type: PrivateOrgActivityType
broader: https://w3id.org/italia/controlled-vocabulary/classifications-for-organizations/ateco-2007/331
notation: 33.11
has rank order: 4
narrower: https://w3id.org/italia/controlled-vocabulary/classifications-for-organizations/ateco-2007/33110
definition: Questa classe include la riparazione e la manutenzione dei prodotti metallici inclusi nella divisione 25 ad eccezione della riparazione e manutenzione di parti intercambiabili per macchine utensili classificata nella classe 33.12.
in scheme: ateco-2007
type: Concept