Riparazione e manutenzione di macchinari
type: Concept
has rank order: 4
notation: 33.12
narrower: https://w3id.org/italia/controlled-vocabulary/classifications-for-organizations/ateco-2007/33122
narrower: https://w3id.org/italia/controlled-vocabulary/classifications-for-organizations/ateco-2007/33123
broader: https://w3id.org/italia/controlled-vocabulary/classifications-for-organizations/ateco-2007/331
definition: Questa classe include la riparazione e la manutenzione di macchine ed apparecchiature industriali come l'affilatura e la sostituzione di lame e seghe su macchinari industriali, oppure servizi di riparazione tramite saldatura; la riparazione di macchine agricole ed altri macchinari ed apparecchiature industriali pesanti (ad esempio: carrelli elevatori ed altri apparecchi di movimentazione di materiali, macchine utensili, impianti di refrigerazione commerciale, macchine per l'edilizia e per miniere), cfr. divisione 28. Dalla classe à¨ esclusa la manutenzione e riparazione di autoveicoli, cfr. divisione 45.
narrower: https://w3id.org/italia/controlled-vocabulary/classifications-for-organizations/ateco-2007/33124
narrower: https://w3id.org/italia/controlled-vocabulary/classifications-for-organizations/ateco-2007/33126
narrower: https://w3id.org/italia/controlled-vocabulary/classifications-for-organizations/ateco-2007/33129
narrower: https://w3id.org/italia/controlled-vocabulary/classifications-for-organizations/ateco-2007/33125
narrower: https://w3id.org/italia/controlled-vocabulary/classifications-for-organizations/ateco-2007/33121
narrower: https://w3id.org/italia/controlled-vocabulary/classifications-for-organizations/ateco-2007/33127
type: PrivateOrgActivityType
in scheme: ateco-2007