RIPARAZIONE E MANUTENZIONE DI PRODOTTI IN METALLO, MACCHINE ED APPARECCHIATURE
type: Concept
in scheme: ateco-2007
narrower: https://w3id.org/italia/controlled-vocabulary/classifications-for-organizations/ateco-2007/3312
narrower: https://w3id.org/italia/controlled-vocabulary/classifications-for-organizations/ateco-2007/3317
narrower: https://w3id.org/italia/controlled-vocabulary/classifications-for-organizations/ateco-2007/3315
narrower: https://w3id.org/italia/controlled-vocabulary/classifications-for-organizations/ateco-2007/3313
broader: https://w3id.org/italia/controlled-vocabulary/classifications-for-organizations/ateco-2007/33
has rank order: 3
narrower: https://w3id.org/italia/controlled-vocabulary/classifications-for-organizations/ateco-2007/3311
notation: 33.1
narrower: https://w3id.org/italia/controlled-vocabulary/classifications-for-organizations/ateco-2007/3316
type: PrivateOrgActivityType
definition: Questo gruppo include la riparazione e la manutenzione da parte di unità specializzate di beni prodotti dal settore manifatturiero, con l'obiettivo di ripristinare le funzionalità di macchine, apparecchiature ed altri prodotti. Il gruppo include l'erogazione di servizi di manutenzione generale o ordinaria (inclusi i servizi di assistenza) destinata a tali prodotti, mirata a garantirne l'efficienza lavorativa e a prevenirne i guasti o le riparazioni non necessarie.
narrower: https://w3id.org/italia/controlled-vocabulary/classifications-for-organizations/ateco-2007/3314
narrower: https://w3id.org/italia/controlled-vocabulary/classifications-for-organizations/ateco-2007/3319