RIPARAZIONE E MANUTENZIONE DI PRODOTTI IN METALLO, MACCHINE ED APPARECCHIATURE
type: Concept
type: PrivateOrgActivityType
broader: 33
definition: Questo gruppo include la riparazione e la manutenzione da parte di unità specializzate di beni prodotti dal settore manifatturiero, con l'obiettivo di ripristinare le funzionalità di macchine, apparecchiature ed altri prodotti. Il gruppo include l'erogazione di servizi di manutenzione generale o ordinaria (inclusi i servizi di assistenza) destinata a tali prodotti, mirata a garantirne l'efficienza lavorativa e a prevenirne i guasti o le riparazioni non necessarie.
in scheme: ateco-2007
narrower: 3312
narrower: 3317
narrower: 3315
narrower: 3313
narrower: 3311
narrower: 3316
narrower: 3314
narrower: 3319
notation: 33.1
has rank order: 3