Installazione di macchine ed apparecchiature industriali
type: PrivateOrgActivityType
broader: https://w3id.org/italia/controlled-vocabulary/classifications-for-organizations/ateco-2007/332
notation: 33.20
has rank order: 4
narrower: https://w3id.org/italia/controlled-vocabulary/classifications-for-organizations/ateco-2007/33200
definition: Questa classe include l'installazione specializzata di macchine. Tuttavia, l'installazione di apparecchiature che costituiscono parte integrante di edifici o strutture simili, come l'installazione di ascensori, impianti elettrici, sistemi di allarme antifurto o impianti di condizionamento dell'aria, à¨ classificata nelle costruzioni (cfr. sez. F).
in scheme: ateco-2007
type: Concept