GESTIONE DELLE RETI FOGNARIE
type: PrivateOrgActivityType
broader: https://w3id.org/italia/controlled-vocabulary/classifications-for-organizations/ateco-2007/E
notation: 37
has rank order: 2
narrower: https://w3id.org/italia/controlled-vocabulary/classifications-for-organizations/ateco-2007/370
definition: Questa divisione include la gestione dei sistemi di fognatura o degli impianti di trattamento delle acque reflue che raccolgono, trattano e smaltiscono i reflui.
in scheme: ateco-2007
type: Concept