RACCOLTA DEI RIFIUTI
type: Concept
narrower: https://w3id.org/italia/controlled-vocabulary/classifications-for-organizations/ateco-2007/3812
has rank order: 3
notation: 38.1
broader: https://w3id.org/italia/controlled-vocabulary/classifications-for-organizations/ateco-2007/38
definition: Questo gruppo include la raccolta di rifiuti provenienti da famiglie e aziende tramite bidoni per la spazzatura, bidoni su ruote, container eccetera. àˆ inclusa la raccolta di rifiuti pericolosi e non pericolosi, ad esempio rifiuti domestici, batterie usate, oli e grassi per cucina usati, oli di scarto provenienti dalle navi e oli esausti provenienti da autofficine, nonchà© rifiuti da costruzione e demolizione.
in scheme: ateco-2007
type: PrivateOrgActivityType
narrower: https://w3id.org/italia/controlled-vocabulary/classifications-for-organizations/ateco-2007/3811