Trattamento e smaltimento di rifiuti pericolosi
type: PrivateOrgActivityType
type: Concept
broader: 382
definition: Questa classe include lo smaltimento e il trattamento che precede lo smaltimento di rifiuti pericolosi solidi o non solidi, quali rifiuti che contengono sostanze esplosive, ossidanti, infiammabili, tossiche, irritanti, cancerogene, corrosive, infettive o altre sostanze e preparati dannosi per la salute umana e per l'ambiente.
in scheme: ateco-2007
narrower: 38220
notation: 38.22
has rank order: 4