ATTIVITÀ DI RACCOLTA, TRATTAMENTO E SMALTIMENTO DEI RIFIUTI; RECUPERO DEI MATERIALI
type: PrivateOrgActivityType
type: Concept
narrower: https://w3id.org/italia/controlled-vocabulary/classifications-for-organizations/ateco-2007/382
narrower: https://w3id.org/italia/controlled-vocabulary/classifications-for-organizations/ateco-2007/381
narrower: https://w3id.org/italia/controlled-vocabulary/classifications-for-organizations/ateco-2007/383
notation: 38
broader: https://w3id.org/italia/controlled-vocabulary/classifications-for-organizations/ateco-2007/E
has rank order: 2
definition: Questa divisione include la raccolta, il trattamento e lo smaltimento di rifiuti. àˆ anche incluso il trasporto locale di rifiuti e la gestione di strutture di recupero (ossia le strutture in cui si separano i materiali riciclabili da un insieme composito di rifiuti).
in scheme: ateco-2007