ATTIVITÀ DI RACCOLTA, TRATTAMENTO E SMALTIMENTO DEI RIFIUTI; RECUPERO DEI MATERIALI
type: PrivateOrgActivityType
type: Concept
broader: E
definition: Questa divisione include la raccolta, il trattamento e lo smaltimento di rifiuti. àˆ anche incluso il trasporto locale di rifiuti e la gestione di strutture di recupero (ossia le strutture in cui si separano i materiali riciclabili da un insieme composito di rifiuti).
in scheme: ateco-2007
narrower: 382
narrower: 381
narrower: 383
notation: 38
has rank order: 2