ATTIVITÀ DI RISANAMENTO E ALTRI SERVIZI DI GESTIONE DEI RIFIUTI
type: PrivateOrgActivityType
broader: https://w3id.org/italia/controlled-vocabulary/classifications-for-organizations/ateco-2007/E
notation: 39
has rank order: 2
narrower: https://w3id.org/italia/controlled-vocabulary/classifications-for-organizations/ateco-2007/390
definition: Questa divisione include l'erogazione di servizi di risanamento, ossia la decontaminazione di edifici e siti contaminati, del suolo, delle acque superficiali e delle acque del sottosuolo.
in scheme: ateco-2007
type: Concept