COSTRUZIONE DI EDIFICI
type: Concept
type: PrivateOrgActivityType
has rank order: 2
notation: 41
narrower: https://w3id.org/italia/controlled-vocabulary/classifications-for-organizations/ateco-2007/412
narrower: https://w3id.org/italia/controlled-vocabulary/classifications-for-organizations/ateco-2007/411
definition: Questa divisione include lavori generali per la costruzione di edifici di qualsiasi tipo. Sono inclusi i nuovi lavori, le riparazioni, le aggiunte e le alterazioni, l'installazione nei cantieri di edifici prefabbricati o di strutture anche di natura temporanea. àˆ compresa inoltre la costruzione di alloggi, edifici adibiti ad uffici, negozi, edifici pubblici e di servizio, fabbricati rurali eccetera.
in scheme: ateco-2007
broader: https://w3id.org/italia/controlled-vocabulary/classifications-for-organizations/ateco-2007/F