Costruzione di opere di pubblica utilità per il trasporto di fluidi
type: PrivateOrgActivityType
broader: https://w3id.org/italia/controlled-vocabulary/classifications-for-organizations/ateco-2007/422
notation: 42.21
has rank order: 4
narrower: https://w3id.org/italia/controlled-vocabulary/classifications-for-organizations/ateco-2007/42210
definition: Questa classe include la costruzione di linee di distribuzione per il trasporto dei fluidi e dei relativi impianti e di strutture che sono parti integranti di tali sistemi.
in scheme: ateco-2007
type: Concept