Costruzione di opere di pubblica utilità per il trasporto di fluidi
type: PrivateOrgActivityType
type: Concept
broader: 422
definition: Questa classe include la costruzione di linee di distribuzione per il trasporto dei fluidi e dei relativi impianti e di strutture che sono parti integranti di tali sistemi.
in scheme: ateco-2007
narrower: 42210
notation: 42.21
has rank order: 4