DEMOLIZIONE E PREPARAZIONE DEL CANTIERE EDILE
type: Concept
type: PrivateOrgActivityType
definition: Questo gruppo include le attività di preparazione di un cantiere edile per i successivi lavori di costruzione, inclusa la rimozione di strutture preesistenti.
notation: 43.1
narrower: https://w3id.org/italia/controlled-vocabulary/classifications-for-organizations/ateco-2007/4311
narrower: https://w3id.org/italia/controlled-vocabulary/classifications-for-organizations/ateco-2007/4313
narrower: https://w3id.org/italia/controlled-vocabulary/classifications-for-organizations/ateco-2007/4312
has rank order: 3
in scheme: ateco-2007
broader: https://w3id.org/italia/controlled-vocabulary/classifications-for-organizations/ateco-2007/43