DEMOLIZIONE E PREPARAZIONE DEL CANTIERE EDILE
type: Concept
type: PrivateOrgActivityType
broader: 43
definition: Questo gruppo include le attività di preparazione di un cantiere edile per i successivi lavori di costruzione, inclusa la rimozione di strutture preesistenti.
in scheme: ateco-2007
narrower: 4311
narrower: 4313
narrower: 4312
notation: 43.1
has rank order: 3