INSTALLAZIONE DI IMPIANTI ELETTRICI, IDRAULICI ED ALTRI LAVORI DI COSTRUZIONE E INSTALLAZIONE
type: Concept
type: PrivateOrgActivityType
broader: 43
definition: Questo gruppo include le attività di installazione di servizi che supportano il funzionamento di un edificio inclusa l'installazione di impianti elettrici, idraulici (acqua, gas e sistemi di fognatura), impianti di riscaldamento e condizionamento dell'aria, ascensori eccetera.
in scheme: ateco-2007
narrower: 4322
narrower: 4329
narrower: 4321
notation: 43.2
has rank order: 3