INTERMEDIARI DEL COMMERCIO
type: PrivateOrgActivityType
notation: 46.1
narrower: https://w3id.org/italia/controlled-vocabulary/classifications-for-organizations/ateco-2007/4611
narrower: https://w3id.org/italia/controlled-vocabulary/classifications-for-organizations/ateco-2007/4619
narrower: https://w3id.org/italia/controlled-vocabulary/classifications-for-organizations/ateco-2007/4617
narrower: https://w3id.org/italia/controlled-vocabulary/classifications-for-organizations/ateco-2007/4616
has rank order: 3
broader: https://w3id.org/italia/controlled-vocabulary/classifications-for-organizations/ateco-2007/46
narrower: https://w3id.org/italia/controlled-vocabulary/classifications-for-organizations/ateco-2007/4618
narrower: https://w3id.org/italia/controlled-vocabulary/classifications-for-organizations/ateco-2007/4615
narrower: https://w3id.org/italia/controlled-vocabulary/classifications-for-organizations/ateco-2007/4614
definition: Questo gruppo include: - attività di operatori di borsa merci, commercianti che effettuano operazioni commerciali a nome e per conto di terzi - attività dei rappresentanti del commercio e intermediari che effettuano transazioni commerciali a nome di un mandante, anche via internet
type: Concept
in scheme: ateco-2007
narrower: https://w3id.org/italia/controlled-vocabulary/classifications-for-organizations/ateco-2007/4613
narrower: https://w3id.org/italia/controlled-vocabulary/classifications-for-organizations/ateco-2007/4612