COMMERCIO ALL'INGROSSO DI APPARECCHIATURE ICT
type: Concept
type: PrivateOrgActivityType
broader: 46
definition: Questo gruppo include il commercio all'ingrosso di apparecchiature per l'informazione e comunicazione tecnologica (ICT) come computer, attrezzature per telecomunicazioni compreso parti e accessori.
in scheme: ateco-2007
narrower: 4651
narrower: 4652
notation: 46.5
has rank order: 3