COMMERCIO ALL'INGROSSO DI ALTRI MACCHINARI, ATTREZZATURE E FORNITURE
type: PrivateOrgActivityType
definition: Questo gruppo include il commercio all'ingrosso di macchinari, attrezzature e forniture per tutti i tipi di industrie e di macchinari di impiego generale.
notation: 46.6
narrower: https://w3id.org/italia/controlled-vocabulary/classifications-for-organizations/ateco-2007/4665
broader: https://w3id.org/italia/controlled-vocabulary/classifications-for-organizations/ateco-2007/46
narrower: https://w3id.org/italia/controlled-vocabulary/classifications-for-organizations/ateco-2007/4666
narrower: https://w3id.org/italia/controlled-vocabulary/classifications-for-organizations/ateco-2007/4663
narrower: https://w3id.org/italia/controlled-vocabulary/classifications-for-organizations/ateco-2007/4664
in scheme: ateco-2007
narrower: https://w3id.org/italia/controlled-vocabulary/classifications-for-organizations/ateco-2007/4661
narrower: https://w3id.org/italia/controlled-vocabulary/classifications-for-organizations/ateco-2007/4662
type: Concept
narrower: https://w3id.org/italia/controlled-vocabulary/classifications-for-organizations/ateco-2007/4669
has rank order: 3