COMMERCIO AL DETTAGLIO DI ARTICOLI CULTURALI E RICREATIVI IN ESERCIZI SPECIALIZZATI
type: Concept
type: PrivateOrgActivityType
narrower: https://w3id.org/italia/controlled-vocabulary/classifications-for-organizations/ateco-2007/4762
narrower: https://w3id.org/italia/controlled-vocabulary/classifications-for-organizations/ateco-2007/4765
narrower: https://w3id.org/italia/controlled-vocabulary/classifications-for-organizations/ateco-2007/4763
narrower: https://w3id.org/italia/controlled-vocabulary/classifications-for-organizations/ateco-2007/4761
narrower: https://w3id.org/italia/controlled-vocabulary/classifications-for-organizations/ateco-2007/4764
has rank order: 3
in scheme: ateco-2007
broader: https://w3id.org/italia/controlled-vocabulary/classifications-for-organizations/ateco-2007/47
definition: Questo gruppo include la vendita al dettaglio in esercizi specializzati di articoli culturali e ricreativi, quali libri, giornali, registrazioni musicali e video, articoli sportivi, giochi e giocattoli.
notation: 47.6