TRASPORTO DI MERCI SU STRADA E SERVIZI DI TRASLOCO
type: Concept
narrower: https://w3id.org/italia/controlled-vocabulary/classifications-for-organizations/ateco-2007/4942
notation: 49.4
definition: Questo gruppo include tutti i tipi di trasporto terrestre di merci (esclusi i trasporti ferroviari).
has rank order: 3
narrower: https://w3id.org/italia/controlled-vocabulary/classifications-for-organizations/ateco-2007/4941
type: PrivateOrgActivityType
broader: https://w3id.org/italia/controlled-vocabulary/classifications-for-organizations/ateco-2007/49
in scheme: ateco-2007