TRASPORTO DI MERCI SU STRADA E SERVIZI DI TRASLOCO
type: Concept
type: PrivateOrgActivityType
broader: 49
definition: Questo gruppo include tutti i tipi di trasporto terrestre di merci (esclusi i trasporti ferroviari).
in scheme: ateco-2007
narrower: 4942
narrower: 4941
notation: 49.4
has rank order: 3