TRASPORTO AEREO
type: Concept
broader: https://w3id.org/italia/controlled-vocabulary/classifications-for-organizations/ateco-2007/H
narrower: https://w3id.org/italia/controlled-vocabulary/classifications-for-organizations/ateco-2007/511
notation: 51
in scheme: ateco-2007
narrower: https://w3id.org/italia/controlled-vocabulary/classifications-for-organizations/ateco-2007/512
type: PrivateOrgActivityType
definition: Questa divisione include il trasporto aereo o spaziale di passeggeri o di merci.
has rank order: 2