Movimentazione merci
type: Concept
in scheme: ateco-2007
notation: 52.24
narrower: https://w3id.org/italia/controlled-vocabulary/classifications-for-organizations/ateco-2007/52243
narrower: https://w3id.org/italia/controlled-vocabulary/classifications-for-organizations/ateco-2007/52244
broader: https://w3id.org/italia/controlled-vocabulary/classifications-for-organizations/ateco-2007/522
narrower: https://w3id.org/italia/controlled-vocabulary/classifications-for-organizations/ateco-2007/52242
type: PrivateOrgActivityType
definition: Questa classe include il carico, lo scarico e lo stivaggio delle merci o bagagli, indipendentemente dal modo di trasporto impiegato. àˆ inclusa l'attività di facchinaggio.
has rank order: 4
narrower: https://w3id.org/italia/controlled-vocabulary/classifications-for-organizations/ateco-2007/52241