ATTIVITÀ DI SUPPORTO AI TRASPORTI
type: Concept
narrower: https://w3id.org/italia/controlled-vocabulary/classifications-for-organizations/ateco-2007/5221
has rank order: 3
broader: https://w3id.org/italia/controlled-vocabulary/classifications-for-organizations/ateco-2007/52
narrower: https://w3id.org/italia/controlled-vocabulary/classifications-for-organizations/ateco-2007/5224
narrower: https://w3id.org/italia/controlled-vocabulary/classifications-for-organizations/ateco-2007/5223
notation: 52.2
in scheme: ateco-2007
narrower: https://w3id.org/italia/controlled-vocabulary/classifications-for-organizations/ateco-2007/5229
definition: Questo gruppo include le attività di supporto al trasporto di passeggeri o merci, quali la gestione di parti delle infrastrutture o delle attività legate alla movimentazione delle merci, effettuate immediatamente prima o dopo un'operazione di trasporto, o durante le successive tappe del trasporto. àˆ inclusa l'attività delle biglietterie diverse dalle agenzie di viaggio. àˆ escluso il servizio di radiocontrollo satellitare dei mezzi di trasporto, cfr. 80.20
narrower: https://w3id.org/italia/controlled-vocabulary/classifications-for-organizations/ateco-2007/5222
type: PrivateOrgActivityType