MAGAZZINAGGIO E ATTIVITÀ DI SUPPORTO AI TRASPORTI
type: PrivateOrgActivityType
type: Concept
has rank order: 2
narrower: https://w3id.org/italia/controlled-vocabulary/classifications-for-organizations/ateco-2007/522
narrower: https://w3id.org/italia/controlled-vocabulary/classifications-for-organizations/ateco-2007/521
definition: Questa divisione include il magazzinaggio e le attività di supporto ai trasporti, quali la gestione di infrastrutture (ad esempio: aeroporti, porti, gallerie, ponti eccetera), le attività delle agenzie di trasporto e dei centri di movimentazione.
in scheme: ateco-2007
broader: https://w3id.org/italia/controlled-vocabulary/classifications-for-organizations/ateco-2007/H
notation: 52