MAGAZZINAGGIO E ATTIVITÀ DI SUPPORTO AI TRASPORTI
type: PrivateOrgActivityType
type: Concept
broader: H
definition: Questa divisione include il magazzinaggio e le attività di supporto ai trasporti, quali la gestione di infrastrutture (ad esempio: aeroporti, porti, gallerie, ponti eccetera), le attività delle agenzie di trasporto e dei centri di movimentazione.
in scheme: ateco-2007
narrower: 522
narrower: 521
notation: 52
has rank order: 2