SERVIZI POSTALI E ATTIVITÀ DI CORRIERE
type: Concept
narrower: https://w3id.org/italia/controlled-vocabulary/classifications-for-organizations/ateco-2007/532
broader: https://w3id.org/italia/controlled-vocabulary/classifications-for-organizations/ateco-2007/H
narrower: https://w3id.org/italia/controlled-vocabulary/classifications-for-organizations/ateco-2007/531
notation: 53
has rank order: 2
type: PrivateOrgActivityType
in scheme: ateco-2007
definition: Questa divisione include i servizi postali e le attività di corriere quali il ritiro, il trasporto e la consegna di lettere e pacchi, secondo norme diverse. àˆ inclusa anche la consegna in ambito locale ed i servizi di pony express.