Ristoranti e attività di ristorazione mobile
type: Concept
type: PrivateOrgActivityType
broader: 561
definition: Questa classe include la fornitura di servizi di ristorazione a clienti, con servizio al tavolo o self-service, sia che consumino il pasto in loco, sia che lo portino via o se lo facciano consegnare a domicilio. àˆ inclusa la preparazione di pasti per il consumo immediato, sia in furgoni attrezzati per la ristorazione ambulante, sia presso banchi del mercato. àˆ inclusa l'eventuale attività di intrattenimento e spettacolo.
in scheme: ateco-2007
narrower: 56102
narrower: 56104
narrower: 56105
narrower: 56101
narrower: 56103
notation: 56.10
has rank order: 4