Fornitura di pasti preparati (catering per eventi)
type: PrivateOrgActivityType
type: Concept
broader: 562
definition: Questa classe include la fornitura di servizi di ristorazione sulla base di accordi contrattuali stipulati con il cliente, nelle sedi stabilite dal cliente, per un evento specifico.
in scheme: ateco-2007
narrower: 56210
notation: 56.21
has rank order: 4