Mense e catering continuativo su base contrattuale
type: PrivateOrgActivityType
narrower: https://w3id.org/italia/controlled-vocabulary/classifications-for-organizations/ateco-2007/56292
narrower: https://w3id.org/italia/controlled-vocabulary/classifications-for-organizations/ateco-2007/56291
definition: Questa classe include i servizi di ristorazione per industrie, ovvero la fornitura di pasti preparati sulla base di accordi contrattuali stipulati con il cliente per uno specifico periodo di tempo. In genere, i pasti sono preparati presso un'unità centrale.
type: Concept
notation: 56.29
in scheme: ateco-2007
broader: https://w3id.org/italia/controlled-vocabulary/classifications-for-organizations/ateco-2007/562
has rank order: 4