FORNITURA DI PASTI PREPARATI (CATERING) E ALTRI SERVIZI DI RISTORAZIONE
type: PrivateOrgActivityType
type: Concept
narrower: https://w3id.org/italia/controlled-vocabulary/classifications-for-organizations/ateco-2007/5621
narrower: https://w3id.org/italia/controlled-vocabulary/classifications-for-organizations/ateco-2007/5629
has rank order: 3
in scheme: ateco-2007
notation: 56.2
broader: https://w3id.org/italia/controlled-vocabulary/classifications-for-organizations/ateco-2007/56
definition: Questo gruppo include la fornitura di pasti preparati (catering) per eventi individuali o per un determinato periodo di tempo, nonchà© la gestione di esercizi di ristorazione in concessione.