FORNITURA DI PASTI PREPARATI (CATERING) E ALTRI SERVIZI DI RISTORAZIONE
type: PrivateOrgActivityType
type: Concept
broader: 56
definition: Questo gruppo include la fornitura di pasti preparati (catering) per eventi individuali o per un determinato periodo di tempo, nonchà© la gestione di esercizi di ristorazione in concessione.
in scheme: ateco-2007
narrower: 5621
narrower: 5629
notation: 56.2
has rank order: 3