Edizione di libri
type: PrivateOrgActivityType
broader: https://w3id.org/italia/controlled-vocabulary/classifications-for-organizations/ateco-2007/581
notation: 58.11
has rank order: 4
narrower: https://w3id.org/italia/controlled-vocabulary/classifications-for-organizations/ateco-2007/58110
definition: Questa classe include le attività legate all'edizione di libri in forma cartacea, in formato elettronico (Cd, visualizzazione elettronica eccetera), audio, o su internet.
in scheme: ateco-2007
type: Concept