Edizione di libri
type: PrivateOrgActivityType
type: Concept
broader: 581
definition: Questa classe include le attività legate all'edizione di libri in forma cartacea, in formato elettronico (Cd, visualizzazione elettronica eccetera), audio, o su internet.
in scheme: ateco-2007
narrower: 58110
notation: 58.11
has rank order: 4