Consulenza nel settore delle tecnologie dell'informatica
type: PrivateOrgActivityType
type: Concept
broader: 620
definition: Questa classe include la pianificazione e progettazione di sistemi informatici che integrano l'hardware dei computer, il software e le tecnologie della comunicazione. Questi servizi possono includere la relativa formazione all'utente finale.
in scheme: ateco-2007
narrower: 62020
notation: 62.02
has rank order: 4