Elaborazione dei dati, hosting e attività connesse
type: PrivateOrgActivityType
narrower: https://w3id.org/italia/controlled-vocabulary/classifications-for-organizations/ateco-2007/63111
in scheme: ateco-2007
definition: Questa classe include la fornitura di servizi di hosting, elaborazione dei dati e attività connesse.
has rank order: 4
type: Concept
narrower: https://w3id.org/italia/controlled-vocabulary/classifications-for-organizations/ateco-2007/63113
broader: https://w3id.org/italia/controlled-vocabulary/classifications-for-organizations/ateco-2007/631
notation: 63.11
narrower: https://w3id.org/italia/controlled-vocabulary/classifications-for-organizations/ateco-2007/63112