ALTRE ATTIVITÀ DEI SERVIZI D'INFORMAZIONE
type: Concept
has rank order: 3
in scheme: ateco-2007
notation: 63.9
narrower: https://w3id.org/italia/controlled-vocabulary/classifications-for-organizations/ateco-2007/6399
type: PrivateOrgActivityType
broader: https://w3id.org/italia/controlled-vocabulary/classifications-for-organizations/ateco-2007/63
definition: Questo gruppo include le attività delle agenzie di stampa e tutte le altre attività dei servizi di informazione.
narrower: https://w3id.org/italia/controlled-vocabulary/classifications-for-organizations/ateco-2007/6391