INTERMEDIAZIONE MONETARIA
type: Concept
notation: 64.1
definition: Questo gruppo include la raccolta di fondi nella forma di depositi a vista, cioà¨ fondi a valore nominale certo, liberamente rimborsabili o trasferibili e, ad eccezione dell'attività della banca centrale, ottenuti da operatori non finanziari.
broader: https://w3id.org/italia/controlled-vocabulary/classifications-for-organizations/ateco-2007/64
in scheme: ateco-2007
narrower: https://w3id.org/italia/controlled-vocabulary/classifications-for-organizations/ateco-2007/6419
type: PrivateOrgActivityType
has rank order: 3
narrower: https://w3id.org/italia/controlled-vocabulary/classifications-for-organizations/ateco-2007/6411