Altre attività di servizi finanziari n.c.a. (escluse le assicurazioni e i fondi pensione)
type: PrivateOrgActivityType
definition: Questa classe include le altre attività di intermediazione finanziaria concernenti soprattutto la distribuzione di fondi non in forma di prestiti: attività di vendita di contratti swap, opzioni e altri contratti di copertura, investimenti per conto proprio in titoli o altri strumenti finanziari, quali le società di venture capital e gli investment club.
has rank order: 4
narrower: https://w3id.org/italia/controlled-vocabulary/classifications-for-organizations/ateco-2007/64994
type: Concept
narrower: https://w3id.org/italia/controlled-vocabulary/classifications-for-organizations/ateco-2007/64993
narrower: https://w3id.org/italia/controlled-vocabulary/classifications-for-organizations/ateco-2007/64996
notation: 64.99
narrower: https://w3id.org/italia/controlled-vocabulary/classifications-for-organizations/ateco-2007/64995
narrower: https://w3id.org/italia/controlled-vocabulary/classifications-for-organizations/ateco-2007/64992
broader: https://w3id.org/italia/controlled-vocabulary/classifications-for-organizations/ateco-2007/649
narrower: https://w3id.org/italia/controlled-vocabulary/classifications-for-organizations/ateco-2007/64991
in scheme: ateco-2007