ALTRE ATTIVITÀ DI SERVIZI FINANZIARI (ESCLUSE LE ASSICURAZIONI E I FONDI PENSIONE)
type: Concept
type: PrivateOrgActivityType
notation: 64.9
narrower: https://w3id.org/italia/controlled-vocabulary/classifications-for-organizations/ateco-2007/6491
narrower: https://w3id.org/italia/controlled-vocabulary/classifications-for-organizations/ateco-2007/6492
narrower: https://w3id.org/italia/controlled-vocabulary/classifications-for-organizations/ateco-2007/6499
in scheme: ateco-2007
has rank order: 3
broader: https://w3id.org/italia/controlled-vocabulary/classifications-for-organizations/ateco-2007/64
definition: Questo gruppo include le intermediazioni finanziarie diverse da quelle condotte da istituzioni monetarie.