ATTIVITÀ DI SERVIZI FINANZIARI (ESCLUSE LE ASSICURAZIONI E I FONDI PENSIONE)
type: PrivateOrgActivityType
narrower: https://w3id.org/italia/controlled-vocabulary/classifications-for-organizations/ateco-2007/649
has rank order: 2
narrower: https://w3id.org/italia/controlled-vocabulary/classifications-for-organizations/ateco-2007/643
narrower: https://w3id.org/italia/controlled-vocabulary/classifications-for-organizations/ateco-2007/641
note: Nota: La normativa nazionale riveste un ruolo significativo nel determinare la classificazione all'interno di questa divisione.
narrower: https://w3id.org/italia/controlled-vocabulary/classifications-for-organizations/ateco-2007/642
in scheme: ateco-2007
type: Concept
notation: 64
broader: https://w3id.org/italia/controlled-vocabulary/classifications-for-organizations/ateco-2007/K
definition: Questa divisione include le attività mirate a raccogliere e redistribuire fondi (escluse le assicurazioni, i fondi pensione e le assicurazioni sociali obbligatorie).