Fondi pensione
type: PrivateOrgActivityType
narrower: https://w3id.org/italia/controlled-vocabulary/classifications-for-organizations/ateco-2007/65302
in scheme: ateco-2007
broader: https://w3id.org/italia/controlled-vocabulary/classifications-for-organizations/ateco-2007/653
notation: 65.30
narrower: https://w3id.org/italia/controlled-vocabulary/classifications-for-organizations/ateco-2007/65303
type: Concept
narrower: https://w3id.org/italia/controlled-vocabulary/classifications-for-organizations/ateco-2007/65301
definition: Questa classe include le entità (ossia fondi, piani e/o programmi) strutturate per erogare prestazioni di tipo pensionistico esclusivamente agli aderenti (lavoratori dipendenti di una determinata categoria o comparto, ovvero lavoratori autonomi e liberi professionisti appartenenti a determinate categorie). Sono inclusi i fondi a prestazione definita, i fondi a contribuzione definita e i contratti di assicurazione sulla vita con finalità pensionistiche.
has rank order: 4