ASSICURAZIONI, RIASSICURAZIONI E FONDI PENSIONE (ESCLUSE LE ASSICURAZIONI SOCIALI OBBLIGATORIE)
type: PrivateOrgActivityType
type: Concept
in scheme: ateco-2007
notation: 65
broader: https://w3id.org/italia/controlled-vocabulary/classifications-for-organizations/ateco-2007/K
has rank order: 2
narrower: https://w3id.org/italia/controlled-vocabulary/classifications-for-organizations/ateco-2007/653
definition: Questa divisione include le rendite vitalizie e le polizze assicurative, nonchà© l'investimento dei premi in un portafoglio di attività finanziarie da utilizzare per il pagamento di indennizzi. àˆ inclusa l'erogazione sia di servizi di assicurazione diretta che di riassicurazione.
narrower: https://w3id.org/italia/controlled-vocabulary/classifications-for-organizations/ateco-2007/651
narrower: https://w3id.org/italia/controlled-vocabulary/classifications-for-organizations/ateco-2007/652