ASSICURAZIONI, RIASSICURAZIONI E FONDI PENSIONE (ESCLUSE LE ASSICURAZIONI SOCIALI OBBLIGATORIE)
type: PrivateOrgActivityType
type: Concept
broader: K
definition: Questa divisione include le rendite vitalizie e le polizze assicurative, nonchà© l'investimento dei premi in un portafoglio di attività finanziarie da utilizzare per il pagamento di indennizzi. àˆ inclusa l'erogazione sia di servizi di assicurazione diretta che di riassicurazione.
in scheme: ateco-2007
narrower: 653
narrower: 651
narrower: 652
notation: 65
has rank order: 2