Altre attività ausiliarie dei servizi finanziari (escluse le assicurazioni e i fondi pensione)
type: PrivateOrgActivityType
narrower: https://w3id.org/italia/controlled-vocabulary/classifications-for-organizations/ateco-2007/66195
definition: Questa classe include le attività ausiliarie dell'intermediazione finanziaria n.c.a.
in scheme: ateco-2007
broader: https://w3id.org/italia/controlled-vocabulary/classifications-for-organizations/ateco-2007/661
type: Concept
narrower: https://w3id.org/italia/controlled-vocabulary/classifications-for-organizations/ateco-2007/66194
narrower: https://w3id.org/italia/controlled-vocabulary/classifications-for-organizations/ateco-2007/66193
narrower: https://w3id.org/italia/controlled-vocabulary/classifications-for-organizations/ateco-2007/66192
notation: 66.19
narrower: https://w3id.org/italia/controlled-vocabulary/classifications-for-organizations/ateco-2007/66191
has rank order: 4