Valutazione dei rischi e dei danni
type: PrivateOrgActivityType
type: Concept
broader: 662
definition: Questa classe include i servizi amministrativi connessi all'assicurazione, quali l'accertamento e il pagamento degli indennizzi.
in scheme: ateco-2007
narrower: 66210
notation: 66.21
has rank order: 4